BDBM50244223 4-Benzylamino-2-{[4-(4-hydroxypiperidin-1-yl)phenyl]amino}pyrimidine-5-carboxamide::CHEMBL517122
SMILES NC(=O)c1cnc(Nc2ccc(cc2)N2CCC(O)CC2)nc1NCc1ccccc1
InChI Key InChIKey=ZNGBJFKIAYXGNA-UHFFFAOYSA-N
Data  1 IC50
  Tab Delimited (TSV)   2D SDfile   Computed 3D by Vconf -m prep SDfile
Find this compound or compounds like it in BindingDB:
Activity Spreadsheet -- Enzyme Inhibition Constant Data from BindingDB
Found 1 hit for monomerid = 50244223
TargetSignal transducer and activator of transcription 6(Homo sapiens (Human))
Astellas Pharma
Curated by ChEMBL
LigandPNGBDBM50244223(4-Benzylamino-2-{[4-(4-hydroxypiperidin-1-yl)pheny...)
Affinity DataIC50:  16nM. Assay description: Inhibition of STAT6 activation (unknown origin) in FW4 reporter cells
In DepthDetails ArticlePubMed