BDBM50244423 (2R,3S,4R,5R,6S)-2-(hydroxymethyl)-6-(3-(3-phenylpropyl)phenyl)-tetrahydro-2H-pyran-3,4,5-triol::CHEMBL520379
SMILES OC[C@H]1O[C@H]([C@H](O)[C@@H](O)[C@@H]1O)c1cccc(CCCc2ccccc2)c1
InChI Key InChIKey=QYVNSTSXNUDJKQ-ADAARDCZSA-N
Data  1 EC50
  Tab Delimited (TSV)   2D SDfile   Computed 3D by Vconf -m prep SDfile
Find this compound or compounds like it in BindingDB:
Activity Spreadsheet -- Enzyme Inhibition Constant Data from BindingDB
Found 1 hit for monomerid = 50244423
TargetSodium/glucose cotransporter 2(Homo sapiens (Human))
Bristol Myers Squibb
Curated by ChEMBL
LigandPNGBDBM50244423((2R,3S,4R,5R,6S)-2-(hydroxymethyl)-6-(3-(3-phenylp...)
Affinity DataEC50:  480nM. Assay description: Inhibition of human SGLT2 expressed in CHO cells assessed as intracellular accumulation of [14C]-alpha-methyl glucopyranoside
In DepthDetails ArticlePubMed