BDBM50244462 (2R,3S,4R,5R,6S)-2-(hydroxymethyl)-6-(3-(p-tolylthio)phenyl)-tetrahydro-2H-pyran-3,4,5-triol::CHEMBL486461
SMILES Cc1ccc(Sc2cccc(c2)[C@@H]2O[C@H](CO)[C@@H](O)[C@H](O)[C@H]2O)cc1
InChI Key InChIKey=CRTBCGCHSYCNOS-FQBWVUSXSA-N
Data  1 EC50
  Tab Delimited (TSV)   2D SDfile   Computed 3D by Vconf -m prep SDfile
Find this compound or compounds like it in BindingDB:
Activity Spreadsheet -- Enzyme Inhibition Constant Data from BindingDB
Found 1 hit for monomerid = 50244462
TargetSodium/glucose cotransporter 2(Homo sapiens (Human))
Bristol Myers Squibb
Curated by ChEMBL
LigandPNGBDBM50244462((2R,3S,4R,5R,6S)-2-(hydroxymethyl)-6-(3-(p-tolylth...)
Affinity DataEC50:  69nM. Assay description: Inhibition of human SGLT2 expressed in CHO cells assessed as intracellular accumulation of [14C]-alpha-methyl glucopyranoside
In DepthDetails ArticlePubMed