BDBM50244515 CHEMBL4104256
SMILES CCCC[C@H](NC(=O)[C@@H]1CCCN1C(=O)[C@H](CC=C)NC(=O)[C@H](CCCCN)NC(=O)[C@H](Cc1cnc[nH]1)NC(=O)[C@H](CO)NC(=O)[C@H](CC=C)NC(=O)[C@H](CCCNC(N)=N)NC(=O)[C@@H]1CCCN1C(=O)[C@H](CCCNC(N)=N)NC(=O)[C@@H]1CCC(=O)N1)C(=O)N1CCC[C@H]1C(=O)N[C@@H](Cc1ccccc1)C(O)=O
InChI Key InChIKey=PSYWAFVSCSTZFG-HBKJHRGCSA-N
Data  1 KI
  Tab Delimited (TSV)   2D SDfile   Computed 3D by Vconf -m prep SDfile
Find this compound or compounds like it in BindingDB:
Activity Spreadsheet -- Enzyme Inhibition Constant Data from BindingDB
Found 1 hit for monomerid = 50244515
TargetApelin receptor(Homo sapiens (Human))
Universit£
Curated by ChEMBL
LigandPNGBDBM50244515(CHEMBL4104256)
Affinity DataKi:  3.90nM. Assay description: Displacement of [125I]-[Nle75, Tyr77] Pyr1-apelin-13 from YFP-tagged human APJ receptor expressed in HEK293 cell membranes after 1 hr by gamma-counti...
In DepthDetails ArticlePubMed