BDBM50244554 CHEMBL508402::rac-(E)-{4-[(4-Chloro-3-fluorophenyl)methylene]-2-(hydroxymethyl)-5-oxo-2-2,3-dihydrofuryl}methyl 2,2-Dimethylpropanoate
SMILES CC(C)(C)C(=O)OCC1(CO)C\C(=C/c2ccc(Cl)c(F)c2)C(=O)O1
InChI Key InChIKey=AMMIKVRYXNRYLI-WUXMJOGZSA-N
Data  2 KI
  Tab Delimited (TSV)   2D SDfile   Computed 3D by Vconf -m prep SDfile
Find this compound or compounds like it in BindingDB:
Activity Spreadsheet -- Enzyme Inhibition Constant Data from BindingDB
Found 2 hits for monomerid = 50244554
TargetProtein kinase C alpha type(MOUSE)
National Cancer Institute-Frederick
Curated by ChEMBL
LigandPNGBDBM50244554(CHEMBL508402 | rac-(E)-{4-[(4-Chloro-3-fluoropheny...)
Affinity DataKi:  7.90nM. Assay description: Displacement of [3H]PDBu form mouse PKCalpha by scintillation counting
In DepthDetails ArticlePubMed
TargetProtein kinase C alpha type(MOUSE)
National Cancer Institute-Frederick
Curated by ChEMBL
LigandPNGBDBM50244554(CHEMBL508402 | rac-(E)-{4-[(4-Chloro-3-fluoropheny...)
Affinity DataKi:  28.8nM. Assay description: Displacement of [3H]PDBu form mouse PKCalpha by scintillation counting
In DepthDetails ArticlePubMed