BDBM50244577 CHEMBL4087671
SMILES CCCC[C@@H]1NC(=O)[C@@H]2CCCN2C(=O)CNC(=O)[C@H](C\C=C/C[C@H](NC1=O)C(=O)N[C@@H](Cc1ccccc1)C(O)=O)NC(=O)[C@H](Cc1cnc[nH]1)NC(=O)[C@H](CO)NC(=O)[C@H](CC(C)C)NC(=O)[C@H](CCCNC(N)=N)NC(=O)[C@@H]1CCCN1C(=O)[C@H](CCCNC(N)=N)NC(=O)[C@@H]1CCC(=O)N1
InChI Key InChIKey=QVSGRSPPNDRTQL-WRRBQJLKSA-N
Data  1 KI  2 EC50
  Tab Delimited (TSV)   2D SDfile   Computed 3D by Vconf -m prep SDfile
Find this compound or compounds like it in BindingDB:
Activity Spreadsheet -- Enzyme Inhibition Constant Data from BindingDB
Found 3 hits for monomerid = 50244577
TargetApelin receptor(Homo sapiens (Human))
Universit£
Curated by ChEMBL
LigandPNGBDBM50244577(CHEMBL4087671)
Affinity DataKi:  14nM. Assay description: Displacement of [125I]-[Nle75, Tyr77] Pyr1-apelin-13 from YFP-tagged human APJ receptor expressed in HEK293 cell membranes after 1 hr by gamma-counti...
In DepthDetails ArticlePubMed
TargetApelin receptor(Homo sapiens (Human))
Universit£
Curated by ChEMBL
LigandPNGBDBM50244577(CHEMBL4087671)
Affinity DataEC50:  825nM. Assay description: Activity at GFP10-tagged human APJ receptor expressed in HEK293 cells assessed as induction of RlucII-tagged beta-arrestin-2 recruitment after 30 min...
In DepthDetails ArticlePubMed
TargetApelin receptor(Homo sapiens (Human))
Universit£
Curated by ChEMBL
LigandPNGBDBM50244577(CHEMBL4087671)
Affinity DataEC50:  30nM. Assay description: Activity at human APJ receptor expressed in HEK293 cells assessed as dissociation of Galphai1 from Gbetagamma subunit after 5 mins by BRET assay
In DepthDetails ArticlePubMed