BDBM50244622 9-(2,6-dimethylstyryl)-N-(4-(dimethylphosphoryl)phenyl)-2-(4-methylpiperazin-1-yl)-9H-purin-6-amine::CHEMBL509941
SMILES CN1CCN(CC1)c1nc(Nc2ccc(cc2)P(C)(C)=O)c2ncn(\C=C\c3c(C)cccc3C)c2n1
InChI Key InChIKey=LHZOGDYGAMOXIH-BUHFOSPRSA-N
Data  2 IC50
  Tab Delimited (TSV)   2D SDfile   Computed 3D by Vconf -m prep SDfile
Find this compound or compounds like it in BindingDB:
Activity Spreadsheet -- Enzyme Inhibition Constant Data from BindingDB
Found 2 hits for monomerid = 50244622
TargetTyrosine-protein kinase ABL1(Homo sapiens (Human))
Ariad Pharmaceuticals
Curated by ChEMBL
LigandPNGBDBM50244622(9-(2,6-dimethylstyryl)-N-(4-(dimethylphosphoryl)ph...)
Affinity DataIC50:  6.80nM. Assay description: Inhibition of Abl kinase
In DepthDetails ArticlePubMed
TargetProto-oncogene tyrosine-protein kinase Src(Homo sapiens (Human))
Ariad Pharmaceuticals
Curated by ChEMBL
LigandPNGBDBM50244622(9-(2,6-dimethylstyryl)-N-(4-(dimethylphosphoryl)ph...)
Affinity DataIC50: <0.230nM. Assay description: Inhibition of human Src kinase by TR-FRET assay
In DepthDetails ArticlePubMed