BDBM50244698 CHEMBL462377::rac-(E/Z)-(4-(3-(trifluoromethyl)benzylidene)-2-(hydroxymethyl)-5-oxo-tetrahydrofuran-2-yl)methyl 3,5,5-trimethylhexanoate
SMILES CC(CC(=O)OCC1(CO)C\C(=C\c2cccc(c2)C(F)(F)F)C(=O)O1)CC(C)(C)C
InChI Key InChIKey=BXISOVMQIGEZCL-MFOYZWKCSA-N
Data  2 KI
  Tab Delimited (TSV)   2D SDfile   Computed 3D by Vconf -m prep SDfile
Find this compound or compounds like it in BindingDB:
Activity Spreadsheet -- Enzyme Inhibition Constant Data from BindingDB
Found 2 hits for monomerid = 50244698
TargetProtein kinase C alpha type(MOUSE)
National Cancer Institute-Frederick
Curated by ChEMBL
LigandPNGBDBM50244698(CHEMBL462377 | rac-(E/Z)-(4-(3-(trifluoromethyl)be...)
Affinity DataKi:  13.3nM. Assay description: Displacement of [3H]PDBu form mouse PKCalpha by scintillation counting
In DepthDetails ArticlePubMed
TargetProtein kinase C alpha type(MOUSE)
National Cancer Institute-Frederick
Curated by ChEMBL
LigandPNGBDBM50244698(CHEMBL462377 | rac-(E/Z)-(4-(3-(trifluoromethyl)be...)
Affinity DataKi:  13.3nM. Assay description: Displacement of [3H]PDBu form mouse PKCalpha by scintillation counting
In DepthDetails ArticlePubMed