BDBM50244853 CHEMBL506586::rac-(E/Z)-(4-heptylidene-2-(hydroxymethyl)-5-oxo-tetrahydrofuran-2-yl)methyl 2-ethylhexanoate
SMILES CCCCCC\C=C1\CC(CO)(COC(=O)C(CC)CCCC)OC1=O
InChI Key InChIKey=OPTBYOCIOURYNC-AQTBWJFISA-N
Data  1 KI
  Tab Delimited (TSV)   2D SDfile   Computed 3D by Vconf -m prep SDfile
Find this compound or compounds like it in BindingDB:
Activity Spreadsheet -- Enzyme Inhibition Constant Data from BindingDB
Found 1 hit for monomerid = 50244853
TargetProtein kinase C alpha type(MOUSE)
National Cancer Institute-Frederick
Curated by ChEMBL
LigandPNGBDBM50244853(CHEMBL506586 | rac-(E/Z)-(4-heptylidene-2-(hydroxy...)
Affinity DataKi:  15.2nM. Assay description: Displacement of [3H]PDBu form mouse PKCalpha by scintillation counting
In DepthDetails ArticlePubMed