BDBM50245057 (R)-trans-3-{4-[1-(4-tert-Butyl-cyclohexyl)-3-(3-methyl-5-trifluoromethylphenyl)ureidomethyl]benzoylamino}-2-hydroxy-propionic acid::CHEMBL486651
SMILES Cc1cc(NC(=O)N(Cc2ccc(cc2)C(=O)NC[C@@H](O)C(O)=O)[C@H]2CC[C@@H](CC2)C(C)(C)C)cc(c1)C(F)(F)F
InChI Key InChIKey=OLGWNKHCHXVJMX-NQHRYMMQSA-N
Data  2 IC50
  Tab Delimited (TSV)   2D SDfile   Computed 3D by Vconf -m prep SDfile
Find this compound or compounds like it in BindingDB:
Activity Spreadsheet -- Enzyme Inhibition Constant Data from BindingDB
Found 2 hits for monomerid = 50245057
TargetGastric inhibitory polypeptide receptor(Homo sapiens (Human))
Novo Nordisk
Curated by ChEMBL
LigandPNGBDBM50245057((R)-trans-3-{4-[1-(4-tert-Butyl-cyclohexyl)-3-(3-m...)
Affinity DataIC50:  98nM. Assay description: Binding affinity to human cloned GIPR expressed in BHK cells
In DepthDetails ArticlePubMed
TargetGlucagon receptor(Homo sapiens (Human))
Novo Nordisk
Curated by ChEMBL
LigandPNGBDBM50245057((R)-trans-3-{4-[1-(4-tert-Butyl-cyclohexyl)-3-(3-m...)
Affinity DataIC50:  10nM. Assay description: Binding affinity to human cloned GluR expressed in BHK cells
In DepthDetails ArticlePubMed