BDBM50245439 (R)-2-[3-Amino-4-(2,4,5-trifluorophenyl)butyryl]-3,4-dihydro-2H-pyrazole-3-carboxylic acid(4-morpholin-4-ylphenyl)amide HCl::CHEMBL471343
SMILES N[C@@H](CC(=O)N1N=CCC1C(=O)Nc1ccc(cc1)N1CCOCC1)Cc1cc(F)c(F)cc1F
InChI Key InChIKey=PLQMZGKELMGIBA-XESZBRCGSA-N
Data  1 IC50
  Tab Delimited (TSV)   2D SDfile   Computed 3D by Vconf -m prep SDfile
Find this compound or compounds like it in BindingDB:
Activity Spreadsheet -- Enzyme Inhibition Constant Data from BindingDB
Found 1 hit for monomerid = 50245439
TargetDipeptidyl peptidase 4(Homo sapiens (Human))
Korea Research Institute Of Chemical Technology
Curated by ChEMBL
LigandPNGBDBM50245439((R)-2-[3-Amino-4-(2,4,5-trifluorophenyl)butyryl]-3...)
Affinity DataIC50:  1.60E+3nM. Assay description: Inhibition of DPP4 in human Caco2 cells after 60 mins by fluorometry assay
In DepthDetails ArticlePubMed