BDBM50245964 (1S,2R)-1-(4-fluoro-2-methylphenoxy)-2-((methylamino)methyl)-2,3-dihydro-1H-inden-2-ol::CHEMBL506137
SMILES CNC[C@]1(O)Cc2ccccc2[C@@H]1Oc1ccc(F)cc1C
InChI Key InChIKey=BLPFKCJJWVVUNI-ZWKOTPCHSA-N
Data  4 IC50
  Tab Delimited (TSV)   2D SDfile   Computed 3D by Vconf -m prep SDfile
Find this compound or compounds like it in BindingDB:
Activity Spreadsheet -- Enzyme Inhibition Constant Data from BindingDB
Found 4 hits for monomerid = 50245964
TargetSodium-dependent noradrenaline transporter(Homo sapiens (Human))
Neurocrine Biosciences
Curated by ChEMBL
LigandPNGBDBM50245964((1S,2R)-1-(4-fluoro-2-methylphenoxy)-2-((methylami...)
Affinity DataIC50:  5nM. Assay description: Inhibition of norepinephrine uptake at human NET transfected in HEK cells
In DepthDetails ArticlePubMed
TargetCytochrome P450 2D6(Homo sapiens (Human))
Neurocrine Biosciences
Curated by ChEMBL
LigandPNGBDBM50245964((1S,2R)-1-(4-fluoro-2-methylphenoxy)-2-((methylami...)
Affinity DataIC50:  1.50E+3nM. Assay description: Inhibition of CYP2D6 (unknown origin)
In DepthDetails ArticlePubMed
TargetSodium-dependent dopamine transporter(Homo sapiens (Human))
Neurocrine Biosciences
Curated by ChEMBL
LigandPNGBDBM50245964((1S,2R)-1-(4-fluoro-2-methylphenoxy)-2-((methylami...)
Affinity DataIC50:  5.00E+3nM. Assay description: Inhibition of dopamine uptake at human DAT transfected in HEK cells
In DepthDetails ArticlePubMed
TargetSodium-dependent serotonin transporter(Homo sapiens (Human))
Neurocrine Biosciences
Curated by ChEMBL
LigandPNGBDBM50245964((1S,2R)-1-(4-fluoro-2-methylphenoxy)-2-((methylami...)
Affinity DataIC50:  6nM. Assay description: Inhibition of serotonin uptake at human SERT transfected in HEK cells
In DepthDetails ArticlePubMed