BDBM50246148 CHEMBL470492::N-(4-(3-chloro-4-methoxybenzylamino)-8-(2-(dimethylamino)ethyl)-7-methoxyquinazolin-6-yl)-2,2,2-trifluoroacetamide
SMILES COc1ccc(CNc2ncnc3c(CCN(C)C)c(OC)c(NC(=O)C(F)(F)F)cc23)cc1Cl
InChI Key InChIKey=HWPFUACZXJSGTJ-UHFFFAOYSA-N
Data  1 IC50
  Tab Delimited (TSV)   2D SDfile   Computed 3D by Vconf -m prep SDfile
Find this compound or compounds like it in BindingDB:
Activity Spreadsheet -- Enzyme Inhibition Constant Data from BindingDB
Found 1 hit for monomerid = 50246148
TargetcGMP-specific 3',5'-cyclic phosphodiesterase(Bos taurus)
Chong Kun Dang Research Institute
Curated by ChEMBL
LigandPNGBDBM50246148(CHEMBL470492 | N-(4-(3-chloro-4-methoxybenzylamino...)
Affinity DataIC50:  14nM. Assay description: Inhibition of bovine PDE5
In DepthDetails ArticlePubMed