BDBM50246214 CHEMBL487897::N3-(2,6-dimethylphenyl)-1-(3-methoxy-3-methylbutyl)-N6-(4-(4-methylpiperazin-1-yl)phenyl)-1H-pyrazolo[3,4-d]pyrimidine-3,6-diamine
SMILES COC(C)(C)CCn1nc(Nc2c(C)cccc2C)c2cnc(Nc3ccc(cc3)N3CCN(C)CC3)nc12
InChI Key InChIKey=SMRCIXIIGDJROI-UHFFFAOYSA-N
Data  2 KI
  Tab Delimited (TSV)   2D SDfile   Computed 3D by Vconf -m prep SDfile
Find this compound or compounds like it in BindingDB:
Activity Spreadsheet -- Enzyme Inhibition Constant Data from BindingDB
Found 2 hits for monomerid = 50246214
TargetActivated CDC42 kinase 1(Homo sapiens (Human))
Amgen
Curated by ChEMBL
LigandPNGBDBM50246214(CHEMBL487897 | N3-(2,6-dimethylphenyl)-1-(3-methox...)
Affinity DataKi:  2nM. Assay description: Inhibition of histidine-tagged ACK1 (amino acids 117 to 489) (unknown origin) expressed in SF9 cells
In DepthDetails ArticlePubMed
TargetActivated CDC42 kinase 1(Homo sapiens (Human))
Amgen
Curated by ChEMBL
LigandPNGBDBM50246214(CHEMBL487897 | N3-(2,6-dimethylphenyl)-1-(3-methox...)
Affinity DataKi:  20nM. Assay description: Inhibition of flag-tagged ACK1 (unknown origin) autophosphorylation expressed in human 293 cells
In DepthDetails ArticlePubMed