BDBM50246530 4-amino-8-benzyl-2-(cyclopentylthio)pteridine-6,7(5H,8H)-dione::CHEMBL462386
SMILES Nc1nc(SC2CCCC2)nc2n(Cc3ccccc3)c(=O)c(=O)[nH]c12
InChI Key InChIKey=AXJAXCOHAVACBZ-UHFFFAOYSA-N
Data  1 IC50
  Tab Delimited (TSV)   2D SDfile   Computed 3D by Vconf -m prep SDfile
Find this compound or compounds like it in BindingDB:
Activity Spreadsheet -- Enzyme Inhibition Constant Data from BindingDB
Found 1 hit for monomerid = 50246530
TargetGlutamate racemase(Enterococcus faecalis)
Astrazeneca R&D Boston
Curated by ChEMBL
LigandPNGBDBM50246530(4-amino-8-benzyl-2-(cyclopentylthio)pteridine-6,7(...)
Affinity DataIC50:  1.90E+3nMpH: 8.0Assay Description:Inhibition of Enterococcus faecalis murI assessed as effect on conversion of D-glutamate to L-glutamate at pH 8.0 by HPLC
In DepthDetails ArticlePubMed