BDBM50246551 CHEMBL513618::rac-2-((ethylamino)methyl)-1-(o-tolyloxy)-2,3-dihydro-1H-inden-2-ol
SMILES CCNCC1(O)Cc2ccccc2C1Oc1ccccc1C
InChI Key InChIKey=FHGGWRRIFBYBAE-UHFFFAOYSA-N
Data  4 IC50
  Tab Delimited (TSV)   2D SDfile   Computed 3D by Vconf -m prep SDfile
Find this compound or compounds like it in BindingDB:
Activity Spreadsheet -- Enzyme Inhibition Constant Data from BindingDB
Found 4 hits for monomerid = 50246551
TargetSodium-dependent noradrenaline transporter(Homo sapiens (Human))
Neurocrine Biosciences
Curated by ChEMBL
LigandPNGBDBM50246551(CHEMBL513618 | rac-2-((ethylamino)methyl)-1-(o-tol...)
Affinity DataIC50:  700nM. Assay description: Inhibition of norepinephrine uptake at human NET transfected in HEK cells
In DepthDetails ArticlePubMed
TargetCytochrome P450 2D6(Homo sapiens (Human))
Neurocrine Biosciences
Curated by ChEMBL
LigandPNGBDBM50246551(CHEMBL513618 | rac-2-((ethylamino)methyl)-1-(o-tol...)
Affinity DataIC50:  1.30E+3nM. Assay description: Inhibition of CYP2D6 (unknown origin)
In DepthDetails ArticlePubMed
TargetSodium-dependent dopamine transporter(Homo sapiens (Human))
Neurocrine Biosciences
Curated by ChEMBL
LigandPNGBDBM50246551(CHEMBL513618 | rac-2-((ethylamino)methyl)-1-(o-tol...)
Affinity DataIC50: >1.00E+4nM. Assay description: Inhibition of dopamine uptake at human DAT transfected in HEK cells
In DepthDetails ArticlePubMed
TargetSodium-dependent serotonin transporter(Homo sapiens (Human))
Neurocrine Biosciences
Curated by ChEMBL
LigandPNGBDBM50246551(CHEMBL513618 | rac-2-((ethylamino)methyl)-1-(o-tol...)
Affinity DataIC50:  5.70E+3nM. Assay description: Inhibition of serotonin uptake at human SERT transfected in HEK cells
In DepthDetails ArticlePubMed