BDBM50246923 1-(2-Chloro-4-[3-(2,6-difluorophenyl)ureidomethyl]benzoyl)-2,3,4,5-tetrahydro-1H-1-benzazepine::CHEMBL509960
SMILES Fc1cccc(F)c1NC(=O)NCc1ccc(C(=O)N2CCCCc3ccccc23)c(Cl)c1
InChI Key InChIKey=SRXBHDRYWBAEKG-UHFFFAOYSA-N
Data  1 EC50
  Tab Delimited (TSV)   2D SDfile   Computed 3D by Vconf -m prep SDfile
Find this compound or compounds like it in BindingDB:
Activity Spreadsheet -- Enzyme Inhibition Constant Data from BindingDB
Found 1 hit for monomerid = 50246923
TargetVasopressin V2 receptor(Homo sapiens (Human))
Vantia
Curated by ChEMBL
LigandPNGBDBM50246923(1-(2-Chloro-4-[3-(2,6-difluorophenyl)ureidomethyl]...)
Affinity DataEC50:  40nM. Assay description: Agonist activity at human vasopressin V2 receptor expressed in HEK293 cells assessed as increase in intracellular cAMP level by CRE-luciferase report...
In DepthDetails ArticlePubMed