BDBM50246991 CHEMBL509770::benzyl (R)-1-((2S,3S)-2-(((S)-6-amino-1-(benzo[d]oxazol-2-yl)-1-oxohexan-2-yl)carbamoyl)-3-methylpyrrolidin-1-yl)-1-oxo-4-phenylbutan-2-ylcarbamate
SMILES C[C@H]1CCN([C@@H]1C(=O)N[C@@H](CCCCN)C(=O)c1nc2ccccc2o1)C(=O)[C@@H](CCc1ccccc1)NC(=O)OCc1ccccc1
InChI Key InChIKey=KEHSMQLNTXWZMZ-VLRDDJHDSA-N
Data  1 KI
  Tab Delimited (TSV)   2D SDfile   Computed 3D by Vconf -m prep SDfile
Find this compound or compounds like it in BindingDB:
Activity Spreadsheet -- Enzyme Inhibition Constant Data from BindingDB
Found 1 hit for monomerid = 50246991
TargetProstasin(Homo sapiens (Human))
Genomics Institute Of The Novartis Research Foundation
Curated by ChEMBL
LigandPNGBDBM50246991(CHEMBL509770 | benzyl (R)-1-((2S,3S)-2-(((S)-6-ami...)
Affinity DataKi:  49nM. Assay description: Binding affinity to human prostasin
In DepthDetails ArticlePubMed