BDBM50247168 CHEMBL4086008
SMILES Cl.CN(C\C=C\c1ccc(cc1)-c1ccccc1)Cc1coc2ccccc12
InChI Key InChIKey=WVZGCZVYPJLYKB-BQYQJAHWSA-N
Data  15 IC50
  Tab Delimited (TSV)   2D SDfile   Computed 3D by Vconf -m prep SDfile
Find this compound or compounds like it in BindingDB:
Activity Spreadsheet -- Enzyme Inhibition Constant Data from BindingDB
Found 15 hits for monomerid = 50247168
TargetCytochrome P450 1A2(Homo sapiens (Human))
East China University Of Science And Technology
Curated by ChEMBL
LigandPNGBDBM50247168(CHEMBL4086008)
Affinity DataIC50:  5.70E+3nM. Assay description: Inhibition of CYP1A2 in human liver microsomes using phenacetin as substrate upto 10 uM after 10 mins in presence of NADPH by LC-MS/MS analysis
In DepthDetails ArticlePubMed
Target4,4'-diapophytoene desaturase (4,4'-diaponeurosporene-forming)(Staphylococcus aureus (strain Newman))
East China University Of Science And Technology
Curated by ChEMBL
LigandPNGBDBM50247168(CHEMBL4086008)
Affinity DataIC50:  400nM. Assay description: Inhibition of Staphylococcus aureus Newman 6His-tagged CrtN expressed in Escherichia coli BL21 (DE3)/pET28a::CrtN assessed as reduction in staphyloxa...
In DepthDetails ArticlePubMed
TargetCytochrome P450 2C9(Homo sapiens (Human))
East China University Of Science And Technology
Curated by ChEMBL
LigandPNGBDBM50247168(CHEMBL4086008)
Affinity DataIC50:  1.00E+4nM. Assay description: Inhibition of CYP2C9 in human liver microsomes using diclofenac as substrate upto 10 uM after 10 mins in presence of NADPH by LC-MS/MS analysis
In DepthDetails ArticlePubMed
TargetCytochrome P450 2C19(Homo sapiens (Human))
East China University Of Science And Technology
Curated by ChEMBL
LigandPNGBDBM50247168(CHEMBL4086008)
Affinity DataIC50:  1.00E+4nM. Assay description: Inhibition of CYP2C19 in human liver microsomes using mephenytoin as substrate upto 10 uM after 45 mins in presence of NADPH by LC-MS/MS analysis
In DepthDetails ArticlePubMed
TargetCytochrome P450 2D6(Homo sapiens (Human))
East China University Of Science And Technology
Curated by ChEMBL
LigandPNGBDBM50247168(CHEMBL4086008)
Affinity DataIC50:  3.20E+3nM. Assay description: Inhibition of CYP2D6 in human liver microsomes using dextromethorphan as substrate upto 10 uM after 20 mins in presence of NADPH by LC-MS/MS analysis
In DepthDetails ArticlePubMed
TargetCytochrome P450 3A4(Homo sapiens (Human))
East China University Of Science And Technology
Curated by ChEMBL
LigandPNGBDBM50247168(CHEMBL4086008)
Affinity DataIC50:  1.00E+4nM. Assay description: Inhibition of CYP3A4 in human liver microsomes using midazolam as substrate upto 10 uM after 5 mins in presence of NADPH by LC-MS/MS analysis
In DepthDetails ArticlePubMed
Target4,4'-diapophytoene desaturase (4,4'-diaponeurosporene-forming)(Staphylococcus aureus (strain Newman))
East China University Of Science And Technology
Curated by ChEMBL
LigandPNGBDBM50247168(CHEMBL4086008)
Affinity DataIC50:  0.800nM. Assay description: Inhibition of CrtN in methicillin-resistant Staphylococcus aureus Mu50 assessed as reduction in staphyloxanthin levels after 48 hrs by spectrophotome...
In DepthDetails ArticlePubMed
TargetPotassium voltage-gated channel subfamily H member 2(Homo sapiens (Human))
East China University Of Science And Technology
Curated by ChEMBL
LigandPNGBDBM50247168(CHEMBL4086008)
Affinity DataIC50:  3.48E+4nM. Assay description: Inhibition of human ERG expressed in CHO cells at -80 mV holding potential after 3 mins by QPatch test
In DepthDetails ArticlePubMed
Target4,4'-diapophytoene desaturase (4,4'-diaponeurosporene-forming)(Staphylococcus aureus (strain Newman))
East China University Of Science And Technology
Curated by ChEMBL
LigandPNGBDBM50247168(CHEMBL4086008)
Affinity DataIC50:  1.80nM. Assay description: Inhibition of CrtN in Staphylococcus aureus Newman after 12 resistant development passages under 0.15% v/v H2O2 assessed as reduction in staphyloxant...
In DepthDetails ArticlePubMed
Target4,4'-diapophytoene desaturase (4,4'-diaponeurosporene-forming)(Staphylococcus aureus (strain MW2))
East China University Of Science And Technology
Curated by ChEMBL
LigandPNGBDBM50247168(CHEMBL4086008)
Affinity DataIC50:  7.90nM. Assay description: Inhibition of CrtN in methicillin-resistant Staphylococcus aureus USA400 MW2 assessed as reduction in staphyloxanthin levels after 48 hrs by spectrop...
In DepthDetails ArticlePubMed
Target4,4'-diapophytoene desaturase (4,4'-diaponeurosporene-forming)(Staphylococcus aureus (strain Newman))
East China University Of Science And Technology
Curated by ChEMBL
LigandPNGBDBM50247168(CHEMBL4086008)
Affinity DataIC50:  2nM. Assay description: Inhibition of CrtN in Staphylococcus aureus Newman assessed as reduction in staphyloxanthin levels after 48 hrs by spectrophotometric method-based pi...
In DepthDetails ArticlePubMed
Target4,4'-diapophytoene desaturase (4,4'-diaponeurosporene-forming)(Staphylococcus aureus (strain Newman))
East China University Of Science And Technology
Curated by ChEMBL
LigandPNGBDBM50247168(CHEMBL4086008)
Affinity DataIC50:  1.90nM. Assay description: Inhibition of CrtN in methicillin-resistant Staphylococcus aureus LAC USA300 assessed as reduction in staphyloxanthin levels after 48 hrs by spectrop...
In DepthDetails ArticlePubMed
TargetCytochrome P450 2C8(Homo sapiens (Human))
East China University Of Science And Technology
Curated by ChEMBL
LigandPNGBDBM50247168(CHEMBL4086008)
Affinity DataIC50:  1.00E+4nM. Assay description: Inhibition of CYP2C8 in human liver microsomes using paclitaxel as substrate upto 10 uM after 20 mins in presence of NADPH by LC-MS/MS analysis
In DepthDetails ArticlePubMed
TargetCytochrome P450 3A4(Homo sapiens (Human))
East China University Of Science And Technology
Curated by ChEMBL
LigandPNGBDBM50247168(CHEMBL4086008)
Affinity DataIC50:  1.00E+4nM. Assay description: Inhibition of CYP3A4 in human liver microsomes using testosterone as substrate upto 10 uM after 5 mins in presence of NADPH by LC-MS/MS analysis
In DepthDetails ArticlePubMed
TargetCytochrome P450 2B6(Homo sapiens (Human))
East China University Of Science And Technology
Curated by ChEMBL
LigandPNGBDBM50247168(CHEMBL4086008)
Affinity DataIC50:  1.00E+4nM. Assay description: Inhibition of CYP2B6 in human liver microsomes using bupropion as substrate upto 10 uM after 10 mins in presence of NADPH by LC-MS/MS analysis
In DepthDetails ArticlePubMed