BDBM50247509 CHEMBL4063882
SMILES Cc1ccc(S[C@@H]2O[C@H](CO)[C@H](O)[C@@H]([C@H]2O)n2cc(nn2)-c2ccccc2F)cc1
InChI Key InChIKey=SPWDDLPVHYIRJF-IFLJBQAJSA-N
Data  2 Kd
PDB links: 1 PDB ID matches this monomer.
  Tab Delimited (TSV)   2D SDfile   Computed 3D by Vconf -m prep SDfile
Find this compound or compounds like it in BindingDB:
Activity Spreadsheet -- Enzyme Inhibition Constant Data from BindingDB
Found 2 hits for monomerid = 50247509
TargetGalectin-1(Homo sapiens (Human))
Lund University
Curated by ChEMBL
LigandPNGBDBM50247509(CHEMBL4063882)
Affinity DataKd:  1.90E+5nM. Assay description: Displacement of 3,3'-dideoxy-3-[4-(fluorescein-5-yl-carbonylaminomethyl)-1H-1,2,3-triazol-1-yl]-3'-(3,5-dimethoxy-benzamido)-1,1'-sulfanediyl-di-beta...
In DepthDetails ArticlePubMed
TargetGalectin-3(Homo sapiens (Human))
Lund University
Curated by ChEMBL
LigandPNGBDBM50247509(CHEMBL4063882)
Affinity DataKd:  9.20E+4nM. Assay description: Displacement of 3,3'-dideoxy-3-[4-(fluorescein-5-yl-carbonylaminomethyl)-1H-1,2,3-triazol-1-yl]-3'-(3,5-dimethoxybenzamido)-1,1'-sulfanediyl-di-beta-...