BDBM50247826 4,5-bis(4-methoxyphenyl)isothiazole::CHEMBL473946
SMILES COc1ccc(cc1)-c1cnsc1-c1ccc(OC)cc1
InChI Key InChIKey=COPANKICKKUPAC-UHFFFAOYSA-N
Data  2 IC50
  Tab Delimited (TSV)   2D SDfile   Computed 3D by Vconf -m prep SDfile
Find this compound or compounds like it in BindingDB:
Activity Spreadsheet -- Enzyme Inhibition Constant Data from BindingDB
Found 2 hits for monomerid = 50247826
TargetProstaglandin G/H synthase 2(Homo sapiens (Human))
Johannes Gutenberg University
Curated by ChEMBL
LigandPNGBDBM50247826(4,5-bis(4-methoxyphenyl)isothiazole | CHEMBL473946)
Affinity DataIC50:  800nM. Assay description: Inhibition of COX2 in LPS-stimulated human blood
In DepthDetails ArticlePubMed
TargetProstaglandin G/H synthase 1(Bos taurus)
Johannes Gutenberg University
Curated by ChEMBL
LigandPNGBDBM50247826(4,5-bis(4-methoxyphenyl)isothiazole | CHEMBL473946)
Affinity DataIC50:  3nM. Assay description: Inhibition of COX1 in bovine platelets assessed as formation of 12-hydroxyheptadecatrienoic acid by HPLC
In DepthDetails ArticlePubMed