BDBM50247871 CHEMBL521965::Methyl 3-[4-{[(benzyloxy)carbonyl]amino}-5-chloro-3-oxoisothiazol-2(3H)-yl]propanoate
SMILES COC(=O)CCn1sc(Cl)c(NC(=O)OCc2ccccc2)c1=O
InChI Key InChIKey=KAYBXJOOGCABPL-UHFFFAOYSA-N
Data  1 IC50
  Tab Delimited (TSV)   2D SDfile   Computed 3D by Vconf -m prep SDfile
Find this compound or compounds like it in BindingDB:
Activity Spreadsheet -- Enzyme Inhibition Constant Data from BindingDB
Found 1 hit for monomerid = 50247871
TargetHistone acetyltransferase KAT2B(Homo sapiens (Human))
University Of Groningen
Curated by ChEMBL
LigandPNGBDBM50247871(CHEMBL521965 | Methyl 3-[4-{[(benzyloxy)carbonyl]a...)
Affinity DataIC50:  4.90E+3nM. Assay description: Inhibition of human recombinant HAT PCAF
In DepthDetails ArticlePubMed