BDBM50248204 CHEMBL514970::N-Adamantan-1-yl-2,5-dihydroxy-benzamide
SMILES Oc1ccc(O)c(c1)C(=O)NC12CC3CC(CC(C3)C1)C2
InChI Key InChIKey=WUKFAHNMIHAGQS-UHFFFAOYSA-N
Data  1 IC50
  Tab Delimited (TSV)   2D SDfile   Computed 3D by Vconf -m prep SDfile
Find this compound or compounds like it in BindingDB:
Activity Spreadsheet -- Enzyme Inhibition Constant Data from BindingDB
Found 1 hit for monomerid = 50248204
TargetPolyphenol oxidase 2(Agaricus bisporus (Common mushroom))
Amorepacific
Curated by ChEMBL
LigandPNGBDBM50248204(CHEMBL514970 | N-Adamantan-1-yl-2,5-dihydroxy-benz...)
Affinity DataIC50: >2.00E+5nM. Assay description: Inhibition of mushroom tyrosinase activity after 20 mins
In DepthDetails ArticlePubMed