BDBM50248668 CHEMBL463238::N-((4-(6-methylpyridin-2-yl)-1-(propylsulfonyl)piperidin-4-yl)methyl)benzamide
SMILES CCCS(=O)(=O)N1CCC(CNC(=O)c2ccccc2)(CC1)c1cccc(C)n1
InChI Key InChIKey=LFIJMLWPBMBHJT-UHFFFAOYSA-N
Data  3 IC50
  Tab Delimited (TSV)   2D SDfile   Computed 3D by Vconf -m prep SDfile
Find this compound or compounds like it in BindingDB:
Activity Spreadsheet -- Enzyme Inhibition Constant Data from BindingDB
Found 3 hits for monomerid = 50248668
TargetSodium- and chloride-dependent glycine transporter 2(Homo sapiens (Human))
Merck
Curated by ChEMBL
LigandPNGBDBM50248668(CHEMBL463238 | N-((4-(6-methylpyridin-2-yl)-1-(pro...)
Affinity DataIC50: >3.00E+4nM. Assay description: Inhibition of glycine transporter 2
In DepthDetails ArticlePubMed
TargetSodium- and chloride-dependent taurine transporter(Homo sapiens (Human))
Merck
Curated by ChEMBL
LigandPNGBDBM50248668(CHEMBL463238 | N-((4-(6-methylpyridin-2-yl)-1-(pro...)
Affinity DataIC50: >3.00E+4nM. Assay description: Inhibition of taurine transporter
In DepthDetails ArticlePubMed
TargetSodium- and chloride-dependent glycine transporter 1(Homo sapiens (Human))
Merck
Curated by ChEMBL
LigandPNGBDBM50248668(CHEMBL463238 | N-((4-(6-methylpyridin-2-yl)-1-(pro...)
Affinity DataIC50:  55nM. Assay description: Inhibition of human glycine transporter 1
In DepthDetails ArticlePubMed