BDBM50248772 2-(1,3-benzodioxol-5-yl)-N,N',4-trimethyl-10Hphenothiazine-1,3-dicarboxamide::CHEMBL515565
SMILES CNC(=O)c1c2Nc3ccccc3Sc2c(C)c(C(C)=O)c1-c1ccc2OCOc2c1
InChI Key InChIKey=WJEWYCDQBDGNCS-UHFFFAOYSA-N
Data  1 IC50
  Tab Delimited (TSV)   2D SDfile   Computed 3D by Vconf -m prep SDfile
Find this compound or compounds like it in BindingDB:
Activity Spreadsheet -- Enzyme Inhibition Constant Data from BindingDB
Found 1 hit for monomerid = 50248772
TargetGlutathione hydrolase 1 proenzyme(Homo sapiens (Human))
Institute Of Chemical Technology
Curated by ChEMBL
LigandPNGBDBM50248772(2-(1,3-benzodioxol-5-yl)-N,N',4-trimethyl-10Hpheno...)
Affinity DataIC50:  1.80E+4nM. Assay description: Inhibition of gamma-glutamyltranspeptidase (unknown origin) by colorimetric assay
In DepthDetails ArticlePubMed