BDBM50249301 (R)-2-((3S,4S)-3-((4-(3,3-difluoro-3-(4-fluorophenyl)propyl)piperidin-1-yl)methyl)-4-(3-fluorophenyl)pyrrolidin-1-yl)-4-methylpentanoic acid::CHEMBL471920
SMILES CC(C)C[C@@H](N1C[C@H](CN2CCC(CCC(F)(F)c3ccc(F)cc3)CC2)[C@H](C1)c1cccc(F)c1)C(O)=O
InChI Key InChIKey=FVTAFOSCFIQSHW-TUMTZTIRSA-N
Data  1 IC50
  Tab Delimited (TSV)   2D SDfile   Computed 3D by Vconf -m prep SDfile
Find this compound or compounds like it in BindingDB:
Activity Spreadsheet -- Enzyme Inhibition Constant Data from BindingDB
Found 1 hit for monomerid = 50249301
TargetC-C chemokine receptor type 5(Homo sapiens (Human))
Beijing University Of Technology
Curated by ChEMBL
LigandPNGBDBM50249301((R)-2-((3S,4S)-3-((4-(3,3-difluoro-3-(4-fluorophen...)
Affinity DataIC50:  0.5nM. Assay description: Displacement of [125I]MIP1alpha from human CCR5 expressed in CHO cells
In DepthDetails ArticlePubMed