BDBM50249550 CHEMBL473419::cis-((R)-3-fluoropyrrolidin-1-yl)((2S,4S)-4-(4-(pyrimidin-2-yl)piperazin-1-yl)pyrrolidin-2-yl)methanone
SMILES F[C@@H]1CCN(C1)C(=O)[C@@H]1C[C@@H](CN1)N1CCN(CC1)c1ncccn1
InChI Key InChIKey=ZVJAHPKIYVGDHR-ILXRZTDVSA-N
Data  3 IC50
  Tab Delimited (TSV)   2D SDfile   Computed 3D by Vconf -m prep SDfile
Find this compound or compounds like it in BindingDB:
Activity Spreadsheet -- Enzyme Inhibition Constant Data from BindingDB
Found 3 hits for monomerid = 50249550
TargetDipeptidyl peptidase 4(Homo sapiens (Human))
Pfizer
Curated by ChEMBL
LigandPNGBDBM50249550(CHEMBL473419 | cis-((R)-3-fluoropyrrolidin-1-yl)((...)
Affinity DataIC50:  51nM. Assay description: Inhibition of human plasma DPP4
In DepthDetails ArticlePubMed
TargetDipeptidyl peptidase 8(Homo sapiens (Human))
Pfizer
Curated by ChEMBL
LigandPNGBDBM50249550(CHEMBL473419 | cis-((R)-3-fluoropyrrolidin-1-yl)((...)
Affinity DataIC50:  1.03E+4nM. Assay description: Inhibition of human recombinant DPP8
In DepthDetails ArticlePubMed
TargetDipeptidyl peptidase 2(Homo sapiens (Human))
Pfizer
Curated by ChEMBL
LigandPNGBDBM50249550(CHEMBL473419 | cis-((R)-3-fluoropyrrolidin-1-yl)((...)
Affinity DataIC50:  2.83E+4nM. Assay description: Inhibition of human recombinant DPP2
In DepthDetails ArticlePubMed