BDBM50249710 CHEMBL4091156
SMILES CCCCNc1nc(N)nc2ccn(Cc3ccncc3)c12
InChI Key InChIKey=GJGJBVGXOBHHEM-UHFFFAOYSA-N
Data  1 EC50
  Tab Delimited (TSV)   2D SDfile   Computed 3D by Vconf -m prep SDfile
Find this compound or compounds like it in BindingDB:
Activity Spreadsheet -- Enzyme Inhibition Constant Data from BindingDB
Found 1 hit for monomerid = 50249710
TargetToll-like receptor 7(Homo sapiens (Human))
Janssen Pharmaceutica
Curated by ChEMBL
LigandPNGBDBM50249710(CHEMBL4091156)
Affinity DataEC50:  750nM. Assay description: Agonist activity at TLR7 in human PBMC assessed as induction of IFNalpha-mediated inhibition of HCV genotype 1b RNA replication in human HuH luc/neo ...
In DepthDetails ArticlePubMed