BDBM50249787 CHEMBL4752218
SMILES COc1cc2n(C)c(=O)c(C)cc2cc1NS(=O)(=O)c1ccc(cc1OC)C#N
InChI Key InChIKey=LQDXWIYREJVTTB-UHFFFAOYSA-N
Data  1 IC50
  Tab Delimited (TSV)   2D SDfile   Computed 3D by Vconf -m prep SDfile
Find this compound or compounds like it in BindingDB:
Activity Spreadsheet -- Enzyme Inhibition Constant Data from BindingDB
Found 1 hit for monomerid = 50249787
TargetDNA gyrase subunit A/B(Escherichia coli (strain K12))
Southwest University
Curated by ChEMBL
LigandPNGBDBM50249787(CHEMBL4752218)
Affinity DataIC50:  1.67E+4nM. Assay description: Inhibition of BRD9 (unknown origin) incubated in dark for 30 mins by TR-FRET assay
In DepthDetails ArticlePubMed