BDBM50249814 3-[2-(3-methoxyphenyl)-5-methyl-3-oxo-2,3-dihydro-1H-pyrazol-4-yl]-6,6-dimethyl-1-phenyl-3-(trifluoromethyl)-3,5,6,7-tetrahydro-1H-indole-2,4-dione::CHEMBL521775
SMILES COc1cccc(c1)-n1[nH]c(C)c(c1=O)C1(C(=O)N(C2=C1C(=O)CC(C)(C)C2)c1ccccc1)C(F)(F)F
InChI Key InChIKey=FIJNXDIXLMBYHK-UHFFFAOYSA-N
Data  1 IC50
  Tab Delimited (TSV)   2D SDfile   Computed 3D by Vconf -m prep SDfile
Find this compound or compounds like it in BindingDB:
Activity Spreadsheet -- Enzyme Inhibition Constant Data from BindingDB
Found 1 hit for monomerid = 50249814
TargetElongation of very long chain fatty acids protein 6(Homo sapiens (Human))
Tsukuba Research Institute
Curated by ChEMBL
LigandPNGBDBM50249814(3-[2-(3-methoxyphenyl)-5-methyl-3-oxo-2,3-dihydro-...)
Affinity DataIC50:  43nM. Assay description: Inhibition of human ELOVL6 expressed in african green monkey COS7 cells assessed as palmitoyl-CoA elongation
In DepthDetails ArticlePubMed