BDBM50249845 CHEMBL4078962
SMILES CC(C)CNC(=O)c1ccc(NC(=O)C(F)(F)F)cc1
InChI Key InChIKey=YUBWNWXUJAJTBB-UHFFFAOYSA-N
Data  1 IC50
  Tab Delimited (TSV)   2D SDfile   Computed 3D by Vconf -m prep SDfile
Find this compound or compounds like it in BindingDB:
Activity Spreadsheet -- Enzyme Inhibition Constant Data from BindingDB
Found 1 hit for monomerid = 50249845
TargetHomeobox protein Nkx-2.5/Transcription factor GATA-4(Mus musculus)
University Of Helsinki
Curated by ChEMBL
LigandPNGBDBM50249845(CHEMBL4078962)
Affinity DataIC50:  4.20E+4nM. Assay description: Inhibition of mouse GATA4/NKX2-5 transcriptional synergy expressed in African green monkey COS-1 cells measured after 30 hrs by dual luciferase repor...
In DepthDetails ArticlePubMed