BDBM50250115 CHEMBL4086388
SMILES C[C@H](NC(=O)C(C)(F)F)[C@H](Oc1ccc2n(ncc2c1)-c1ccc(F)cc1)c1ccc2CCOc2c1
InChI Key InChIKey=OLZWUYBINLEAPW-LMKMVOKYSA-N
Data  2 IC50
  Tab Delimited (TSV)   2D SDfile   Computed 3D by Vconf -m prep SDfile
Find this compound or compounds like it in BindingDB:
Activity Spreadsheet -- Enzyme Inhibition Constant Data from BindingDB
Found 2 hits for monomerid = 50250115
TargetGlucocorticoid receptor(Homo sapiens (Human))
Astrazeneca
Curated by ChEMBL
LigandPNGBDBM50250115(CHEMBL4086388)
Affinity DataIC50:  0.101nM. Assay description: Transrepression of glucocorticoid receptor in PMA-stimulated human ChaGoK1 cells expressing TRE-LacZ construct assessed as inhibition of AP-1 mediate...
In DepthDetails ArticlePubMed
TargetGlucocorticoid receptor(Homo sapiens (Human))
Astrazeneca
Curated by ChEMBL
LigandPNGBDBM50250115(CHEMBL4086388)
Affinity DataIC50:  0.0320nM. Assay description: Transrepression of glucocorticoid receptor in PMA-stimulated human ChaGoK1 cells expressing TRE-LacZ construct assessed as inhibition of AP-1 mediate...
In DepthDetails ArticlePubMed