BDBM50250117 CHEMBL4078531
SMILES C[C@H](NC(=O)C(C)(F)F)[C@H](Oc1ccc2n(ncc2c1)-c1cccc(c1)C(=O)N1CCC[C@H]1C(N)=O)c1ccccc1
InChI Key InChIKey=UQKBJBGSERPCAE-DOYMOWJKSA-N
Data  1 IC50
  Tab Delimited (TSV)   2D SDfile   Computed 3D by Vconf -m prep SDfile
Find this compound or compounds like it in BindingDB:
Activity Spreadsheet -- Enzyme Inhibition Constant Data from BindingDB
Found 1 hit for monomerid = 50250117
TargetGlucocorticoid receptor(Homo sapiens (Human))
Astrazeneca
Curated by ChEMBL
LigandPNGBDBM50250117(CHEMBL4078531)
Affinity DataIC50:  17nM. Assay description: Transrepression of glucocorticoid receptor in PMA-stimulated human ChaGoK1 cells expressing TRE-LacZ construct assessed as inhibition of AP-1 mediate...
In DepthDetails ArticlePubMed