BDBM50250232 CHEMBL4079103
SMILES COC(=O)c1ccc(OCCN2CCCC2)c(NC(=O)COc2ccc(cc2)C23CC4CC(CC(C4)C2)C3)c1
InChI Key InChIKey=QXDJBZNNCHQJQN-UHFFFAOYSA-N
Data  2 IC50
  Tab Delimited (TSV)   2D SDfile   Computed 3D by Vconf -m prep SDfile
Find this compound or compounds like it in BindingDB:
Activity Spreadsheet -- Enzyme Inhibition Constant Data from BindingDB
Found 2 hits for monomerid = 50250232
TargetMalate dehydrogenase, cytoplasmic(Homo sapiens (Human))
Dongguk University
Curated by ChEMBL
LigandPNGBDBM50250232(CHEMBL4079103)
Affinity DataIC50: >4.00E+4nM. Assay description: Inhibition of human MDH1 expressed in Escherichia coli after 30 mins by oxaloacetate-dependent NADH oxidation assay
In DepthDetails ArticlePubMed
TargetMalate dehydrogenase, mitochondrial(Homo sapiens (Human))
Dongguk University
Curated by ChEMBL
LigandPNGBDBM50250232(CHEMBL4079103)
Affinity DataIC50: >4.00E+4nM. Assay description: Inhibition of human MDH2 after 30 mins by oxaloacetate-dependent NADH oxidation assay
In DepthDetails ArticlePubMed