BDBM50250641 CHEMBL4069450::US10961200, Compound 97::US11247971, Cmpd ID 97
SMILES OC(=O)c1csc(n1)-n1nc(cc1O)-c1ccc(F)cc1F
InChI Key InChIKey=SDKJZBQEODPXEQ-UHFFFAOYSA-N
Data  4 IC50
  Tab Delimited (TSV)   2D SDfile   Computed 3D by Vconf -m prep SDfile
Find this compound or compounds like it in BindingDB:
Activity Spreadsheet -- Enzyme Inhibition Constant Data from BindingDB
Found 4 hits for monomerid = 50250641
TargetL-lactate dehydrogenase A chain(Homo sapiens (Human))
National Center For Advancing Translational Sciences
Curated by ChEMBL
LigandPNGBDBM50250641(CHEMBL4069450 | US10961200, Compound 97 | US112479...)
Affinity DataIC50:  84nM. Assay description: Inhibition of human liver LDHA using sodium pyruvate as substrate after 5 mins in presence of NAPDH and in absence of EDTA by diaphorase/resazurin ba...
Ligand InfoPC cidPC sid
In DepthDetails ArticlePubMed
TargetL-lactate dehydrogenase A chain(Homo sapiens (Human))
National Center For Advancing Translational Sciences
Curated by ChEMBL
LigandPNGBDBM50250641(CHEMBL4069450 | US10961200, Compound 97 | US112479...)
Affinity DataIC50: >5.70E+4nM. Assay description: Test compounds were placed in a Greiner Bio-One (Monroe, N.C.) 1536-well black solid bottom assay plate. 200 millimolar (mM) Tris HCl, pH 7.4, 100 mi...
Ligand InfoPC cidPC sid
In DepthDetails US Patent
TargetL-lactate dehydrogenase A chain(Homo sapiens (Human))
National Center For Advancing Translational Sciences
Curated by ChEMBL
LigandPNGBDBM50250641(CHEMBL4069450 | US10961200, Compound 97 | US112479...)
Affinity DataIC50: >5.70E+4nM. Assay description: Test compounds were placed in a Greiner Bio-One (Monroe, N.C.) 1536-well black solid bottom assay plate. 200 millimolar (mM) Tris HCl, pH 7.4, 100 mi...
Ligand InfoPC cidPC sid
In DepthDetails US Patent
TargetL-lactate dehydrogenase A chain(Homo sapiens (Human))
National Center For Advancing Translational Sciences
Curated by ChEMBL
LigandPNGBDBM50250641(CHEMBL4069450 | US10961200, Compound 97 | US112479...)
Affinity DataIC50: >5.70E+4nM. Assay description: Inhibition of human liver LDHA using sodium pyruvate as substrate after 5 mins in presence of NAPDH and EDTA by diaphorase/resazurin based fluorescen...
Ligand InfoPC cidPC sid
In DepthDetails ArticlePubMed