BDBM50250674 CHEMBL4076973::US10961200, Compound 53::US11247971, Cmpd ID 452
SMILES NS(=O)(=O)c1ccc(Cc2c(O)n(nc2-c2ccc(F)c(F)c2)-c2nc(cs2)C(O)=O)cc1
InChI Key InChIKey=HADCVZAHKWNLJA-UHFFFAOYSA-N
Data  10 IC50  1 Kd  1 EC50
PDB links: 2 PDB IDs match this monomer.
  Tab Delimited (TSV)   2D SDfile   Computed 3D by Vconf -m prep SDfile
Find this compound or compounds like it in BindingDB:
Activity Spreadsheet -- Enzyme Inhibition Constant Data from BindingDB
Found 12 hits for monomerid = 50250674
TargetL-lactate dehydrogenase B chain(Homo sapiens (Human))
National Center For Advancing Translational Sciences
Curated by ChEMBL
LigandPNGBDBM50250674(CHEMBL4076973 | US10961200, Compound 53 | US112479...)
Affinity DataIC50:  724nM. Assay description: Inhibition of human erythrocytes LDHB using sodium pyruvate as substrate after 5 mins in presence of NAPDH by diaphorase/resazurin based fluorescence...
In DepthDetails ArticlePubMed
TargetL-lactate dehydrogenase A chain(Homo sapiens (Human))
National Center For Advancing Translational Sciences
Curated by ChEMBL
LigandPNGBDBM50250674(CHEMBL4076973 | US10961200, Compound 53 | US112479...)
Affinity DataIC50:  672nM. Assay description: Inhibition of human liver LDHA using sodium pyruvate as substrate after 5 mins in presence of NAPDH and EDTA by diaphorase/resazurin based fluorescen...
TargetIsocitrate dehydrogenase [NADP] cytoplasmic(Homo sapiens (Human))
National Center For Advancing Translational Sciences
Curated by ChEMBL
LigandPNGBDBM50250674(CHEMBL4076973 | US10961200, Compound 53 | US112479...)
Affinity DataIC50: >5.70E+4nM. Assay description: Inhibition of wild type IDH1 (unknown origin) using isocitrate as substrate preincubated for 30 mins followed by substrate addition in presence of NA...
In DepthDetails ArticlePubMed
TargetL-lactate dehydrogenase A chain(Homo sapiens (Human))
National Center For Advancing Translational Sciences
Curated by ChEMBL
LigandPNGBDBM50250674(CHEMBL4076973 | US10961200, Compound 53 | US112479...)
Affinity DataKd:  370nM. Assay description: Inhibition of human liver LDHA using sodium pyruvate as substrate after 5 mins in presence of NAPDH and EDTA by diaphorase/resazurin based fluorescen...
TargetL-lactate dehydrogenase A chain(Homo sapiens (Human))
National Center For Advancing Translational Sciences
Curated by ChEMBL
LigandPNGBDBM50250674(CHEMBL4076973 | US10961200, Compound 53 | US112479...)
Affinity DataIC50: >5.70E+4nM. Assay description: Inhibition of human liver LDHA using sodium pyruvate as substrate after 5 mins in presence of NAPDH and EDTA by diaphorase/resazurin based fluorescen...
TargetL-lactate dehydrogenase A chain(Homo sapiens (Human))
National Center For Advancing Translational Sciences
Curated by ChEMBL
LigandPNGBDBM50250674(CHEMBL4076973 | US10961200, Compound 53 | US112479...)
Affinity DataIC50:  550nM. Assay description: Test compounds were placed in a Greiner Bio-One (Monroe, N.C.) 1536-well black solid bottom assay plate. 200 millimolar (mM) Tris HCl, pH 7.4, 100 mi...
TargetL-lactate dehydrogenase A chain(Homo sapiens (Human))
National Center For Advancing Translational Sciences
Curated by ChEMBL
LigandPNGBDBM50250674(CHEMBL4076973 | US10961200, Compound 53 | US112479...)
Affinity DataIC50:  672nM. Assay description: Inhibition of human liver LDHA using sodium pyruvate as substrate after 5 mins in presence of NAPDH and in absence of EDTA by diaphorase/resazurin ba...
TargetL-lactate dehydrogenase A chain(Homo sapiens (Human))
National Center For Advancing Translational Sciences
Curated by ChEMBL
LigandPNGBDBM50250674(CHEMBL4076973 | US10961200, Compound 53 | US112479...)
Affinity DataIC50: >5.70E+4nM. Assay description: Inhibition of LDH in human MIAPaCa2 cells assessed as reduction in lactate production preincubated for 2 hrs measured after 30 mins by high throughpu...
TargetL-lactate dehydrogenase A chain(Homo sapiens (Human))
National Center For Advancing Translational Sciences
Curated by ChEMBL
LigandPNGBDBM50250674(CHEMBL4076973 | US10961200, Compound 53 | US112479...)
Affinity DataIC50:  550nM. Assay description: Test compounds were placed in a Greiner Bio-One (Monroe, N.C.) 1536-well black solid bottom assay plate. 200 millimolar (mM) Tris HCl, pH 7.4, 100 mi...
TargetL-lactate dehydrogenase A chain(Homo sapiens (Human))
National Center For Advancing Translational Sciences
Curated by ChEMBL
LigandPNGBDBM50250674(CHEMBL4076973 | US10961200, Compound 53 | US112479...)
Affinity DataIC50:  550nM. Assay description: Test compounds were placed in a Greiner Bio-One (Monroe, N.C.) 1536-well black solid bottom assay plate. 200 millimolar (mM) Tris HCl, pH 7.4, 100 mi...
TargetL-lactate dehydrogenase A chain(Homo sapiens (Human))
National Center For Advancing Translational Sciences
Curated by ChEMBL
LigandPNGBDBM50250674(CHEMBL4076973 | US10961200, Compound 53 | US112479...)
Affinity DataIC50:  550nM. Assay description: Test compounds were placed in a Greiner Bio-One (Monroe, N.C.) 1536-well black solid bottom assay plate. 200 millimolar (mM) Tris HCl, pH 7.4, 100 mi...
TargetL-lactate dehydrogenase A chain(Homo sapiens (Human))
National Center For Advancing Translational Sciences
Curated by ChEMBL
LigandPNGBDBM50250674(CHEMBL4076973 | US10961200, Compound 53 | US112479...)
Affinity DataEC50:  3.53E+3nM. Assay description: Inhibition of human liver LDHA using sodium pyruvate as substrate after 5 mins in presence of NAPDH and EDTA by diaphorase/resazurin based fluorescen...