BDBM50250814 CHEMBL4068858
SMILES Nc1nccc(n1)-c1c[nH]c2ncc(cc12)-c1ccc(OC(F)(F)F)cc1
InChI Key InChIKey=WRJVXZDHOXZXQE-UHFFFAOYSA-N
Data  2 IC50
  Tab Delimited (TSV)   2D SDfile   Computed 3D by Vconf -m prep SDfile
Find this compound or compounds like it in BindingDB:
Activity Spreadsheet -- Enzyme Inhibition Constant Data from BindingDB
Found 2 hits for monomerid = 50250814
TargetCyclin-T1/Cyclin-dependent kinase 9(Homo sapiens (Human))
Csir-Indian Institute Of Integrative Medicine
Curated by ChEMBL
LigandPNGBDBM50250814(CHEMBL4068858)
Affinity DataIC50:  27nM. Assay description: Inhibition of CDK9/cyclin T (unknown origin) using YSPTSPSYSPTSPSYSPTSPKKK as substrate after 30 mins in presence of [33P]-gamma-ATP
In DepthDetails ArticlePubMed
TargetCyclin-A2/Cyclin-dependent kinase 2(Homo sapiens (Human))
Csir-Indian Institute Of Integrative Medicine
Curated by ChEMBL
LigandPNGBDBM50250814(CHEMBL4068858)
Affinity DataIC50:  5nM. Assay description: Inhibition of CDK2/cyclin A (unknown origin) using histone H1 as substrate after 30 mins in presence of [33P]-gamma-ATP
In DepthDetails ArticlePubMed