BDBM50250903 (5Z,9Z)-5,9-heptacosadienoic acid::CHEMBL463437
SMILES CCCCCCCCCCCCCCCCC\C=C/CC\C=C/CCCC(O)=O
InChI Key InChIKey=QHCUSXRHMXVISV-ZCIBKELESA-N
Data  1 IC50
  Tab Delimited (TSV)   2D SDfile   Computed 3D by Vconf -m prep SDfile
Find this compound or compounds like it in BindingDB:
Activity Spreadsheet -- Enzyme Inhibition Constant Data from BindingDB
Found 1 hit for monomerid = 50250903
TargetDNA topoisomerase 1(Homo sapiens (Human))
University Of Puerto Rico
Curated by ChEMBL
LigandPNGBDBM50250903((5Z,9Z)-5,9-heptacosadienoic acid | CHEMBL463437)
Affinity DataIC50:  900nM. Assay description: Inhibition of human DNA topoisomerase 1
In DepthDetails ArticlePubMed