BDBM50251570 CHEMBL480507::butyl N-({2-[4-(diethylcarbamoyl)phenyl]benzene}sulfonyl)carbamate
SMILES CCCCOC(=O)NS(=O)(=O)c1ccccc1-c1ccc(cc1)C(=O)N(CC)CC
InChI Key InChIKey=GGNLYTMMLGWDCJ-UHFFFAOYSA-N
Data  2 KI
  Tab Delimited (TSV)   2D SDfile   Computed 3D by Vconf -m prep SDfile
Find this compound or compounds like it in BindingDB:
Activity Spreadsheet -- Enzyme Inhibition Constant Data from BindingDB
Found 2 hits for monomerid = 50251570
TargetType-1 angiotensin II receptor(Sus scrofa)
Uppsala University
Curated by ChEMBL
LigandPNGBDBM50251570(CHEMBL480507 | butyl N-({2-[4-(diethylcarbamoyl)ph...)
Affinity DataKi:  402nM. Assay description: Displacement of [125]Ang2 from AT2 receptor in pig uterus membrane
In DepthDetails ArticlePubMed
TargetType-1 angiotensin II receptor A(RAT)
Uppsala University
Curated by ChEMBL
LigandPNGBDBM50251570(CHEMBL480507 | butyl N-({2-[4-(diethylcarbamoyl)ph...)
Affinity DataKi: >1.00E+4nM. Assay description: Displacement of [125]Ang2 from AT1 receptor in rat liver membrane
In DepthDetails ArticlePubMed