BDBM50251602 (+/-)-2-(2,6-diethylphenyl)-4-methoxy-N-(5-methoxy-2-methylphenyl)-N-methyl-5,6,7,8-tetrahydroquinolin-5-amine::CHEMBL480892
SMILES CCc1cccc(CC)c1-c1cc(OC)c2C(CCCc2n1)N(C)c1cc(OC)ccc1C
InChI Key InChIKey=DOKDYONJNNVZHC-UHFFFAOYSA-N
Data  1 IC50
  Tab Delimited (TSV)   2D SDfile   Computed 3D by Vconf -m prep SDfile
Find this compound or compounds like it in BindingDB:
Activity Spreadsheet -- Enzyme Inhibition Constant Data from BindingDB
Found 1 hit for monomerid = 50251602
TargetC5a anaphylatoxin chemotactic receptor 1(Homo sapiens (Human))
Johnson & Johnson Pharmaceutical Research And Development
Curated by ChEMBL
LigandPNGBDBM50251602((+/-)-2-(2,6-diethylphenyl)-4-methoxy-N-(5-methoxy...)
Affinity DataIC50:  560nM. Assay description: Antagonist activity at human recombinant C5a receptor in U937 cells assessed as inhibition of C5a-induced calcium mobilization by FLIPR assay
In DepthDetails ArticlePubMed