BDBM50251753 CHEMBL4095080
SMILES O=c1[nH]c(cc(-c2cccc3ccccc23)c1C#N)-c1ccc2ccccc2c1
InChI Key InChIKey=XFUVPGVOHRRGFU-UHFFFAOYSA-N
Data  1 IC50
  Tab Delimited (TSV)   2D SDfile   Computed 3D by Vconf -m prep SDfile
Find this compound or compounds like it in BindingDB:
Activity Spreadsheet -- Enzyme Inhibition Constant Data from BindingDB
Found 1 hit for monomerid = 50251753
TargetSerine/threonine-protein kinase pim-1(Homo sapiens (Human))
Ain Shams University
Curated by ChEMBL
LigandPNGBDBM50251753(CHEMBL4095080)
Affinity DataIC50:  1.00E+4nM. Assay description: Inhibition of human PIM1 measured after 5 mins by ELISA relative to control
In DepthDetails ArticlePubMed