BDBM50251775 CHEMBL480347::endo-4-((3-(4-(4-chlorophenoxy)phenylamino)-8-aza-bicyclo[3.2.1]octan-8-yl)methyl)benzoic acid
SMILES OC(=O)c1ccc(CN2[C@H]3CC[C@@H]2C[C@@H](C3)Nc2ccc(Oc3ccc(Cl)cc3)cc2)cc1
InChI Key InChIKey=YNEHXDKZAIYITC-BKFWDETESA-N
Data  2 IC50
  Tab Delimited (TSV)   2D SDfile   Computed 3D by Vconf -m prep SDfile
Find this compound or compounds like it in BindingDB:
Activity Spreadsheet -- Enzyme Inhibition Constant Data from BindingDB
Found 2 hits for monomerid = 50251775
TargetLeukotriene A-4 hydrolase(Homo sapiens (Human))
Berlex Biosciences
Curated by ChEMBL
LigandPNGBDBM50251775(CHEMBL480347 | endo-4-((3-(4-(4-chlorophenoxy)phen...)
Affinity DataIC50:  310nM. Assay description: Inhibition of LTA4 hydrolase in human whole blood
In DepthDetails ArticlePubMed
TargetLeukotriene A-4 hydrolase(Homo sapiens (Human))
Berlex Biosciences
Curated by ChEMBL
LigandPNGBDBM50251775(CHEMBL480347 | endo-4-((3-(4-(4-chlorophenoxy)phen...)
Affinity DataIC50:  6nM. Assay description: Inhibition of LTA4 hydrolase (unknown origin)
In DepthDetails ArticlePubMed