BDBM50251867 CHEMBL518310::N-(3-((6-chloropyridin-3-yl)methyl)thiazol-2(3H)-ylidene)-2,2,2-trifluoroacetamide
SMILES FC(F)(F)C(=O)\N=c1/sccn1Cc1ccc(Cl)nc1
InChI Key InChIKey=VBEAIKGZKGLSLL-YVLHZVERSA-N
Data  1 IC50
  Tab Delimited (TSV)   2D SDfile   Computed 3D by Vconf -m prep SDfile
Find this compound or compounds like it in BindingDB:
Activity Spreadsheet -- Enzyme Inhibition Constant Data from BindingDB
Found 1 hit for monomerid = 50251867
TargetNeuronal acetylcholine receptor subunit alpha-4(Gallus gallus)
University Of California
Curated by ChEMBL
LigandPNGBDBM50251867(CHEMBL518310 | N-(3-((6-chloropyridin-3-yl)methyl)...)
Affinity DataIC50:  500nM. Assay description: Displacement of [3H]nicotine from chick alpha4beta2 nAChR
In DepthDetails ArticlePubMed