BDBM50252066 4-[(4-Trifluoromethoxybenzyl)thio]-7-(beta-D-ribofuranosyl)-7Hpyrrolo[2,3-d]pyrimidine::CHEMBL482107
SMILES OC[C@H]1O[C@H]([C@H](O)[C@@H]1O)n1ccc2c(SCc3ccc(OC(F)(F)F)cc3)ncnc12
InChI Key InChIKey=UJMJATDXAJIXDR-ATNYBXOESA-N
Data  1 KI
  Tab Delimited (TSV)   2D SDfile   Computed 3D by Vconf -m prep SDfile
Find this compound or compounds like it in BindingDB:
Activity Spreadsheet -- Enzyme Inhibition Constant Data from BindingDB
Found 1 hit for monomerid = 50252066
TargetAdenosine kinase(Toxoplasma gondii)
University Of Georgia
Curated by ChEMBL
LigandPNGBDBM50252066(4-[(4-Trifluoromethoxybenzyl)thio]-7-(beta-D-ribof...)
Affinity DataKi:  3.50E+4nM. Assay description: Binding affinity to purified Toxoplasma gondii adenosine kinase
In DepthDetails ArticlePubMed