BDBM50252292 CHEMBL4067391
SMILES C(COc1ccc2nc(oc2c1)-c1cccc(c1)C1CCNCC1)CN1CCCC1
InChI Key InChIKey=PMACZYRZYCCPKP-UHFFFAOYSA-N
Data  3 IC50
  Tab Delimited (TSV)   2D SDfile   Computed 3D by Vconf -m prep SDfile
Find this compound or compounds like it in BindingDB:
Activity Spreadsheet -- Enzyme Inhibition Constant Data from BindingDB
Found 3 hits for monomerid = 50252292
TargetToll-like receptor 9(Homo sapiens (Human))
Csir-Indian Institute Of Chemical Biology
Curated by ChEMBL
LigandPNGBDBM50252292(CHEMBL4067391)
Affinity DataIC50:  133nM. Assay description: Antagonist activity at human TLR9 expressed in HEK293 cells assessed as inhibition of CpGB-induced NF-kappaB activation after 24 hrs by spectrophotom...
In DepthDetails ArticlePubMed
TargetToll-like receptor 7(Homo sapiens (Human))
Csir-Indian Institute Of Chemical Biology
Curated by ChEMBL
LigandPNGBDBM50252292(CHEMBL4067391)
Affinity DataIC50:  4.99E+3nM. Assay description: Antagonist activity at TLR7 (unknown origin)
In DepthDetails ArticlePubMed
TargetToll-like receptor 7(Homo sapiens (Human))
Csir-Indian Institute Of Chemical Biology
Curated by ChEMBL
LigandPNGBDBM50252292(CHEMBL4067391)
Affinity DataIC50:  4.99E+3nM. Assay description: Antagonist activity at human TLR7 expressed in HEK293 cells assessed as inhibition of CL264-induced NF-kappaB activation after 24 hrs by spectrophoto...
In DepthDetails ArticlePubMed