BDBM50252611 5,6,7,8-Tetrafluoro-4-oxo-1-(pentafluoro-phenyl)-1,4-dihydroquinoline-3-carboxylic acid::CHEMBL494258
SMILES OC(=O)c1cn(-c2c(F)c(F)c(F)c(F)c2F)c2c(F)c(F)c(F)c(F)c2c1=O
InChI Key InChIKey=PPSCWVMHYJJOBZ-UHFFFAOYSA-N
Data  1 EC50
  Tab Delimited (TSV)   2D SDfile   Computed 3D by Vconf -m prep SDfile
Find this compound or compounds like it in BindingDB:
Activity Spreadsheet -- Enzyme Inhibition Constant Data from BindingDB
Found 1 hit for monomerid = 50252611
TargetSignal transducer and activator of transcription 3(Homo sapiens (Human))
Wyeth Research
Curated by ChEMBL
LigandPNGBDBM50252611(5,6,7,8-Tetrafluoro-4-oxo-1-(pentafluoro-phenyl)-1...)
Affinity DataEC50:  4.60E+4nM. Assay description: Inhibition of STAT3 Y705 phosphorylation in human U266 cells by western blot analysis
In DepthDetails ArticlePubMed