BDBM50252793 CHEMBL493060::N-{[1-(3,3-dimethylbutyl)piperidin-4-yl]methyl}-1-(4-fluorophenyl)cyclohexanecarboxamide
SMILES CC(C)(C)CCN1CCC(CNC(=O)C2(CCCCC2)c2ccc(F)cc2)CC1
InChI Key InChIKey=MAMUSVZGQPEVAS-UHFFFAOYSA-N
Data  2 IC50
  Tab Delimited (TSV)   2D SDfile   Computed 3D by Vconf -m prep SDfile
Find this compound or compounds like it in BindingDB:
Activity Spreadsheet -- Enzyme Inhibition Constant Data from BindingDB
Found 2 hits for monomerid = 50252793
TargetPotassium voltage-gated channel subfamily H member 2(Homo sapiens (Human))
Merck Research Laboratories
Curated by ChEMBL
LigandPNGBDBM50252793(CHEMBL493060 | N-{[1-(3,3-dimethylbutyl)piperidin-...)
Affinity DataIC50:  3.67E+3nM. Assay description: Inhibition of human ERG
In DepthDetails ArticlePubMed
TargetVoltage-dependent T-type calcium channel subunit alpha-1I(Homo sapiens (Human))
Merck Research Laboratories
Curated by ChEMBL
LigandPNGBDBM50252793(CHEMBL493060 | N-{[1-(3,3-dimethylbutyl)piperidin-...)
Affinity DataIC50:  99nM. Assay description: Inhibition of T-type calcium channel alpha1I (unknown origin) by FLIPR
In DepthDetails ArticlePubMed