BDBM50252796 3,5-dichloro-N-{[1-(2-hydroxy-3,3-dimethylbutyl)piperidin-4-yl]methyl}benzamide::CHEMBL495302
SMILES CC(C)(C)C(O)CN1CCC(CNC(=O)c2cc(Cl)cc(Cl)c2)CC1
InChI Key InChIKey=AOZIWWIJQOHWMS-UHFFFAOYSA-N
Data  2 IC50
  Tab Delimited (TSV)   2D SDfile   Computed 3D by Vconf -m prep SDfile
Find this compound or compounds like it in BindingDB:
Activity Spreadsheet -- Enzyme Inhibition Constant Data from BindingDB
Found 2 hits for monomerid = 50252796
TargetPotassium voltage-gated channel subfamily H member 2(Homo sapiens (Human))
Merck Research Laboratories
Curated by ChEMBL
LigandPNGBDBM50252796(3,5-dichloro-N-{[1-(2-hydroxy-3,3-dimethylbutyl)pi...)
Affinity DataIC50:  4.81E+3nM. Assay description: Inhibition of human ERG
In DepthDetails ArticlePubMed
TargetVoltage-dependent T-type calcium channel subunit alpha-1I(Homo sapiens (Human))
Merck Research Laboratories
Curated by ChEMBL
LigandPNGBDBM50252796(3,5-dichloro-N-{[1-(2-hydroxy-3,3-dimethylbutyl)pi...)
Affinity DataIC50:  252nM. Assay description: Inhibition of T-type calcium channel alpha1I (unknown origin) by FLIPR
In DepthDetails ArticlePubMed