BDBM50252799 4-phenyl-3,4-dihydrospiro[chromene-2,4'-piperidine]::CHEMBL493687
SMILES C1CC2(CCN1)CC(c1ccccc1)c1ccccc1O2
InChI Key InChIKey=WCWLMTUPFMIZFY-UHFFFAOYSA-N
Data  1 KI
  Tab Delimited (TSV)   2D SDfile   Computed 3D by Vconf -m prep SDfile
Find this compound or compounds like it in BindingDB:
Activity Spreadsheet -- Enzyme Inhibition Constant Data from BindingDB
Found 1 hit for monomerid = 50252799
TargetDelta-type opioid receptor(Homo sapiens (Human))
Adolor
Curated by ChEMBL
LigandPNGBDBM50252799(4-phenyl-3,4-dihydrospiro[chromene-2,4'-piperidine...)
Affinity DataKi:  160nM. Assay description: Displacement of [3H]diprenorphine from human delta opioid receptor in CHO cells
In DepthDetails ArticlePubMed