BDBM50252827 CHEMBL493688::N-Cyclohexylethyl-ETAV
SMILES CC(C)[C@H](NC(=O)[C@H](C)NC(=O)[C@@H](NC(=O)[C@H](CCC(O)=O)NCCC1CCCCC1)C(C)O)C(O)=O
InChI Key InChIKey=APPLGLBBZPGQBX-GDEPEFMTSA-N
Data  5 KI
  Tab Delimited (TSV)   2D SDfile   Computed 3D by Vconf -m prep SDfile
Find this compound or compounds like it in BindingDB:
Activity Spreadsheet -- Enzyme Inhibition Constant Data from BindingDB
Found 5 hits for monomerid = 50252827
TargetDisks large homolog 4(Homo sapiens (Human))
University Of Copenhagen
Curated by ChEMBL
LigandPNGBDBM50252827(CHEMBL493688 | N-Cyclohexylethyl-ETAV)
Affinity DataKi:  450nM. Assay description: Binding affinity to human PSD95 domain PDZ2 expressed in Escherichia coli BL21-DE3 by fluorescence polarization assay
In DepthDetails ArticlePubMed
TargetDisks large homolog 4(Homo sapiens (Human))
University Of Copenhagen
Curated by ChEMBL
LigandPNGBDBM50252827(CHEMBL493688 | N-Cyclohexylethyl-ETAV)
Affinity DataKi:  630nM. Assay description: Inhibition of PSD-95 PDZ2 domain by competitive fluorescence polarization assay
In DepthDetails ArticlePubMed
TargetDisks large homolog 4(Homo sapiens (Human))
University Of Copenhagen
Curated by ChEMBL
LigandPNGBDBM50252827(CHEMBL493688 | N-Cyclohexylethyl-ETAV)
Affinity DataKi:  940nM. Assay description: Binding affinity to human PSD95 domain PDZ1 expressed in Escherichia coli BL21-DE3 by fluorescence polarization assay
In DepthDetails ArticlePubMed
TargetDisks large homolog 4(Homo sapiens (Human))
University Of Copenhagen
Curated by ChEMBL
LigandPNGBDBM50252827(CHEMBL493688 | N-Cyclohexylethyl-ETAV)
Affinity DataKi:  1.10E+4nM. Assay description: Inhibition of PSD-95 PDZ3 domain by competitive fluorescence polarization assay
In DepthDetails ArticlePubMed
TargetDisks large homolog 4(Homo sapiens (Human))
University Of Copenhagen
Curated by ChEMBL
LigandPNGBDBM50252827(CHEMBL493688 | N-Cyclohexylethyl-ETAV)
Affinity DataKi:  1.10E+4nM. Assay description: Binding affinity to human PSD95 domain PDZ3 expressed in Escherichia coli BL21-DE3 by fluorescence polarization assay
In DepthDetails ArticlePubMed